{"text_format":"3","workbook":"xlsx","n_sheets":5,"sheets":["通过名单","核准项目 (2)","Sheet2","Sheet5","Sheet6"],"not_rendered":{"defined_names":8},"read":"whole","date_system":"1900"}

{"sheet":"通过名单","index":0,"n_rows":143,"n_cols":14,"rows_kept":143}
["附件1"]
["【开平市】江门市外贸高质量创新发展资金审核通过名单"]
["序号","企业名称","统一社会信用代码","支持方向","项目类别    ","项目名称","申请支持金额（元）","核准可申请支持金额（元）","备注","项目申报人","手机号","开户银行","开户户名","银行账号"]
[{"$f":"ROW()-3","v":1},"开平市锦强五金制品有限公司","91440783MA53EQM9X8","开拓市场","境外参展","2024年6月13日-6月15日 迪拜世贸中心 2023年第十四届中国（阿联酋）贸易博览会",{"v":17906,"d":"17,906.00"},{"v":17906,"d":"17,906.00"},null,"邝锦源","18824076668","广东开平农村商业银行股份有限公司水口支行","开平市锦强五金制品有限公司","80020000013805231"]
[{"$f":"ROW()-3","v":2},"开平市朝升卫浴有限公司","91440783741747873R","开拓市场","境外参展","2023年第十五届中国（阿联酋）贸易博览会",{"v":20000,"d":"20,000.00"},{"v":20000,"d":"20,000.00"},null,"梁丽莹","13428286143","中国工商银行股份有限公司开平水口科技支行","广东华艺卫浴实业有限公司","2012008109024805928"]
[3,"开平市诺曼卫浴有限公司","914407837912243684","开拓市场","境外参展","2023年09月20日-09月22日南非（约翰内斯堡）2023年第七届中国（南非）贸易博览会",{"v":20000,"d":"20,000.00"},{"v":20000,"d":"20,000.00"},null,"邝群仙","13809605529","中国银行","开平市朝升卫浴有限公司","630171951180"]
[4,"开平市新明光五金制品有限公司","9144078374917810XU","开拓市场","境外参展","2023年第四届中国（印尼）贸易博览会",{"v":20000,"d":"20,000.00"},{"v":20000,"d":"20,000.00"},null,"岑彩婷","18933158882","广东开平农村商业银行股份有限公司翠山湖科技支行","开平市亿展阀芯有限公司","80020000009698007"]
[5,"开平市智康卫浴有限公司","914407830568482469","开拓市场","境外参展","2023年第五届中国（印尼）贸易博览会",{"v":20000,"d":"20,000.00"},{"v":20000,"d":"20,000.00"},null,"邝锦豪","15907506208","中国建设银行股份有限公司江门开平水口支行","开平市诺曼卫浴有限公司","44001670905053000484"]
[6,"开平市谛玛卫浴有限公司","91440783304208484F","开拓市场","境外参展","2023年12月19日-12月21日-阿联酋（迪拜）2023年第十五届中国（阿联酋）贸易博览会",{"v":20000,"d":"20,000.00"},{"v":20000,"d":"20,000.00"},null,"黄远健","19107506507","广东开平农村商业银行股份有限公司","开平市新明光五金制品有限公司","80020000000463129"]
[7,"开平市谛玛卫浴有限公司","91440783304208484F","开拓市场","境外参展","2023年12月5日-12月7日-墨西哥（墨西哥城）2023年第八届中国（墨西哥）贸易博览会",{"v":20000,"d":"20,000.00"},{"v":20000,"d":"20,000.00"},null,"黄先生","19107506507","广东开平农村商业银行股份有限公司","开平市新明光五金制品有限公司","80020000000463129"]
[8,"开平市领雅厨卫有限公司","91440784314926199J","开拓市场","境外参展","2023年第十届中国（巴西）贸易博览会（秋季展）",{"v":20000,"d":"20,000.00"},{"v":20000,"d":"20,000.00"},null,"黄秀云","13422641961","中国工商银行股份有限公司江门开平水口科技支行","开平市和洋洁具有限公司","2012008109200064945"]
[9,"开平市伯源卫浴有限公司","91440783MA51M77439","开拓市场","境外参展","2023年第十五届中国（阿联酋）贸易博览会",{"v":20000,"d":"20,000.00"},{"v":20000,"d":"20,000.00"},null,"区金容","13822369233","中国工商银行股份有限公司","开平力蒲卫浴有限公司","2012008109024216838"]
[10,"江门市凯逸卫浴有限公司","91440783MABULGW9XP","开拓市场","境外参展","2023年第十五届中国（阿联酋）贸易博览会",{"v":20000,"d":"20,000.00"},{"v":20000,"d":"20,000.00"},null,"徐艺文","13725999568","中国工商银行","开平市金特卫浴有限公司","2012032409024810913"]
[11,"江门市凯逸卫浴有限公司","91440783MABULGW9XP","开拓市场","境外参展","2023年越南胡志明市国际建材展览会",{"v":20000,"d":"20,000.00"},{"v":20000,"d":"20,000.00"},null,"邓小姐","13427165755","广东开平农村商业银行股份有限公司","开平市惠普卫浴实业有限公司","80020000000463243"]
[12,"江门市凯逸卫浴有限公司","91440783MABULGW9XP","开拓市场","境外参展","2023年第四届中国（印尼）贸易展览会",{"v":20000,"d":"20,000.00"},{"v":20000,"d":"20,000.00"},null,"何惠芳","13555681163","中国农业银行","开平市力泰五金制品有限公司","44402601040007006"]
[13,"开平市宝来塑胶制品有限公司","9144078374709798XT","开拓市场","境外参展","2023年12月7日-12月9日越南国际贸易展览会",{"v":20000,"d":"20,000.00"},{"v":20000,"d":"20,000.00"},null,"关颖莹","18802550728","中国工商银行","广东顶尖管业科技有限公司","2012008109024857785"]
[14,"开平市宝来塑胶制品有限公司","9144078374709798XT","开拓市场","境外参展","2023年6月18日—6月20日 德国科隆园艺展览会  -SPOGA+GAFA 2023",{"v":20000,"d":"20,000.00"},{"v":20000,"d":"20,000.00"},null,"甄劲云","13426729221","广东开平农村商业银行股份有限公司","开平市东陶压铸卫浴有限公司","80020000000456600"]
[15,"开平市易洁卫浴有限公司","914407833232734337","开拓市场","境外参展","2023年12月19日-12月21日阿联酋（迪拜）2023年第十五届中国（阿联酋）贸易博览会",{"v":20000,"d":"20,000.00"},{"v":20000,"d":"20,000.00"},null,"李建海","13902551679","中国建设银行江门开平水口支行","开平市汉玛克卫浴有限公司","44001670905059001688"]
[16,"开平市鸿士达卫浴实业有限公司","91440783724392193T","开拓市场","境外参展","第27届中国国际厨房、卫浴设施展览会",{"v":40000,"d":"40,000.00"},{"v":40000,"d":"40,000.00"},null,"孔飞球","13926932069","中国建设银行股份有限公司开平支行","开平市智康卫浴有限公司","44001670905053004442"]
[17,"开平市叁拾玖度卫浴有限公司","91440783MA555MJ76P","开拓市场","境外参展","2023 年第十五届中国(阿联酋)贸易博览会",{"v":40000,"d":"40,000.00"},{"v":40000,"d":"40,000.00"},null,"张卉","13828056883","中国银行","开平市谛玛卫浴有限公司","660063953302"]
{"$rows_left_out":124}
{"sheet":"核准项目 (2)","index":1,"n_rows":143,"n_cols":15,"rows_kept":143,"hidden":true}
[null,"附件"]
["【开平市】2024年江门市外贸高质量创新发展资金申报情况汇总表"]
[null,"序号","企业名称","统一社会信用代码","支持方向","项目类别    ","项目名称","申请支持金额（元）","核准可申请支持金额（元）","备注","项目申报人","手机号","开户银行","开户户名","银行账号"]
[{"$f":"ROW()-3","v":1},{"$f":"ROW()-3","v":1},"开平市锦强五金制品有限公司","91440783MA53EQM9X8","开拓市场","境外参展","2024年6月13日-6月15日 迪拜世贸中心 2023年第十四届中国（阿联酋）贸易博览会",{"v":17906,"d":"17,906.00"},{"v":17906,"d":"17,906.00"},null,"邝锦源","18824076668","广东开平农村商业银行股份有限公司水口支行","开平市锦强五金制品有限公司","80020000013805231"]
[{"$f":"ROW()-3","v":2},{"$f":"ROW()-3","v":2},"开平市朝升卫浴有限公司","91440783741747873R","开拓市场","境外参展","2023年第十五届中国（阿联酋）贸易博览会",{"v":20000,"d":"20,000.00"},{"v":20000,"d":"20,000.00"},null,"梁丽莹","13428286143","中国工商银行股份有限公司开平水口科技支行","广东华艺卫浴实业有限公司","2012008109024805928"]
[3,3,"开平市诺曼卫浴有限公司","914407837912243684","开拓市场","境外参展","2023年09月20日-09月22日南非（约翰内斯堡）2023年第七届中国（南非）贸易博览会",{"v":20000,"d":"20,000.00"},{"v":20000,"d":"20,000.00"},null,"邝群仙","13809605529","中国银行","开平市朝升卫浴有限公司","630171951180"]
[4,4,"开平市新明光五金制品有限公司","9144078374917810XU","开拓市场","境外参展","2023年第四届中国（印尼）贸易博览会",{"v":20000,"d":"20,000.00"},{"v":20000,"d":"20,000.00"},null,"岑彩婷","18933158882","广东开平农村商业银行股份有限公司翠山湖科技支行","开平市亿展阀芯有限公司","80020000009698007"]
[5,5,"开平市智康卫浴有限公司","914407830568482469","开拓市场","境外参展","2023年第五届中国（印尼）贸易博览会",{"v":20000,"d":"20,000.00"},{"v":20000,"d":"20,000.00"},null,"邝锦豪","15907506208","中国建设银行股份有限公司江门开平水口支行","开平市诺曼卫浴有限公司","44001670905053000484"]
[6,6,"开平市谛玛卫浴有限公司","91440783304208484F","开拓市场","境外参展","2023年12月19日-12月21日-阿联酋（迪拜）2023年第十五届中国（阿联酋）贸易博览会",{"v":20000,"d":"20,000.00"},{"v":20000,"d":"20,000.00"},null,"黄远健","19107506507","广东开平农村商业银行股份有限公司","开平市新明光五金制品有限公司","80020000000463129"]
[7,7,"开平市谛玛卫浴有限公司","91440783304208484F","开拓市场","境外参展","2023年12月5日-12月7日-墨西哥（墨西哥城）2023年第八届中国（墨西哥）贸易博览会",{"v":20000,"d":"20,000.00"},{"v":20000,"d":"20,000.00"},null,"黄先生","19107506507","广东开平农村商业银行股份有限公司","开平市新明光五金制品有限公司","80020000000463129"]
[8,8,"开平市领雅厨卫有限公司","91440784314926199J","开拓市场","境外参展","2023年第十届中国（巴西）贸易博览会（秋季展）",{"v":20000,"d":"20,000.00"},{"v":20000,"d":"20,000.00"},null,"黄秀云","13422641961","中国工商银行股份有限公司江门开平水口科技支行","开平市和洋洁具有限公司","2012008109200064945"]
[9,9,"开平市伯源卫浴有限公司","91440783MA51M77439","开拓市场","境外参展","2023年第十五届中国（阿联酋）贸易博览会",{"v":20000,"d":"20,000.00"},{"v":20000,"d":"20,000.00"},null,"区金容","13822369233","中国工商银行股份有限公司","开平力蒲卫浴有限公司","2012008109024216838"]
[10,10,"江门市凯逸卫浴有限公司","91440783MABULGW9XP","开拓市场","境外参展","2023年第十五届中国（阿联酋）贸易博览会",{"v":20000,"d":"20,000.00"},{"v":20000,"d":"20,000.00"},null,"徐艺文","13725999568","中国工商银行","开平市金特卫浴有限公司","2012032409024810913"]
[11,11,"江门市凯逸卫浴有限公司","91440783MABULGW9XP","开拓市场","境外参展","2023年越南胡志明市国际建材展览会",{"v":20000,"d":"20,000.00"},{"v":20000,"d":"20,000.00"},null,"邓小姐","13427165755","广东开平农村商业银行股份有限公司","开平市惠普卫浴实业有限公司","80020000000463243"]
[12,12,"江门市凯逸卫浴有限公司","91440783MABULGW9XP","开拓市场","境外参展","2023年第四届中国（印尼）贸易展览会",{"v":20000,"d":"20,000.00"},{"v":20000,"d":"20,000.00"},null,"何惠芳","13555681163","中国农业银行","开平市力泰五金制品有限公司","44402601040007006"]
[13,13,"开平市宝来塑胶制品有限公司","9144078374709798XT","开拓市场","境外参展","2023年12月7日-12月9日越南国际贸易展览会",{"v":20000,"d":"20,000.00"},{"v":20000,"d":"20,000.00"},null,"关颖莹","18802550728","中国工商银行","广东顶尖管业科技有限公司","2012008109024857785"]
[14,14,"开平市宝来塑胶制品有限公司","9144078374709798XT","开拓市场","境外参展","2023年6月18日—6月20日 德国科隆园艺展览会  -SPOGA+GAFA 2023",{"v":20000,"d":"20,000.00"},{"v":20000,"d":"20,000.00"},null,"甄劲云","13426729221","广东开平农村商业银行股份有限公司","开平市东陶压铸卫浴有限公司","80020000000456600"]
[15,15,"开平市易洁卫浴有限公司","914407833232734337","开拓市场","境外参展","2023年12月19日-12月21日阿联酋（迪拜）2023年第十五届中国（阿联酋）贸易博览会",{"v":20000,"d":"20,000.00"},{"v":20000,"d":"20,000.00"},null,"李建海","13902551679","中国建设银行江门开平水口支行","开平市汉玛克卫浴有限公司","44001670905059001688"]
[16,16,"开平市鸿士达卫浴实业有限公司","91440783724392193T","开拓市场","境外参展","第27届中国国际厨房、卫浴设施展览会",{"v":40000,"d":"40,000.00"},{"v":40000,"d":"40,000.00"},null,"孔飞球","13926932069","中国建设银行股份有限公司开平支行","开平市智康卫浴有限公司","44001670905053004442"]
[17,17,"开平市叁拾玖度卫浴有限公司","91440783MA555MJ76P","开拓市场","境外参展","2023 年第十五届中国(阿联酋)贸易博览会",{"v":40000,"d":"40,000.00"},{"v":40000,"d":"40,000.00"},null,"张卉","13828056883","中国银行","开平市谛玛卫浴有限公司","660063953302"]
{"$rows_left_out":124}
{"sheet":"Sheet2","index":2,"n_rows":85,"n_cols":13,"rows_kept":85,"hidden":true}
["开平市锦强五金制品有限公司","开平市锦强五金制品有限公司",null,null,"广东华艺卫浴实业有限公司","广东华艺卫浴实业有限公司",null,null,"广东华艺卫浴实业有限公司","广东华艺卫浴实业有限公司",null,"广东华艺卫浴实业有限公司","广东华艺卫浴实业有限公司"]
["开平市预发卫浴有限公司","开平市预发卫浴有限公司",null,null,"广东可味巧克力食品有限公司","广东可味巧克力食品有限公司",null,null,"广东科仕特精密机械有限公司","广东科仕特精密机械有限公司",null,"广东可味巧克力食品有限公司","广东可味巧克力食品有限公司"]
["开平市朝升卫浴有限公司","开平市朝升卫浴有限公司",null,null,"广东泰宝聚合物有限公司","广东泰宝聚合物有限公司",null,null,"广东可味巧克力食品有限公司","广东可味巧克力食品有限公司",null,"广东泰宝聚合物有限公司","广东泰宝聚合物有限公司"]
["开平市亿展阀芯有限公司","开平市亿展阀芯有限公司",null,null,"广东伟祥卫浴实业有限公司","广东伟祥卫浴实业有限公司",null,null,"广东泰宝聚合物有限公司","广东泰宝聚合物有限公司",null,"广东伟祥卫浴实业有限公司","广东伟祥卫浴实业有限公司"]
["开平市诺曼卫浴有限公司","开平市诺曼卫浴有限公司",null,null,"江门市德美佳厨具有限公司","江门市德美佳厨具有限公司",null,null,"广东伟祥卫浴实业有限公司","广东伟祥卫浴实业有限公司",null,"江门市德美佳厨具有限公司","江门市德美佳厨具有限公司"]
["开平市新明光五金制品有限公司","开平市新明光五金制品有限公司",null,null,"江门雅固卫浴实业有限公司","江门雅固卫浴实业有限公司",null,null,"广东意希诺科技有限公司","广东意希诺科技有限公司",null,"江门雅固卫浴实业有限公司","江门雅固卫浴实业有限公司"]
["开平市新明光五金制品有限公司","开平市和洋洁具有限公司",null,null,"开平柏斯高卫浴有限公司","开平柏斯高卫浴有限公司",null,null,"江门雅固卫浴实业有限公司","江门雅固卫浴实业有限公司",null,"开平柏斯高卫浴有限公司","开平柏斯高卫浴有限公司"]
["开平市和洋洁具有限公司","开平力蒲卫浴有限公司",null,null,"开平凯德家用电器有限公司","开平凯德家用电器有限公司",null,null,"开平柏斯高卫浴有限公司","开平柏斯高卫浴有限公司",null,"开平凯德家用电器有限公司","开平凯德家用电器有限公司"]
["开平力蒲卫浴有限公司","开平市金特卫浴有限公司",null,null,"开平美迪晨卫浴有限公司","开平美迪晨卫浴有限公司",null,null,"开平凯德家用电器有限公司","开平凯德家用电器有限公司",null,"开平美迪晨卫浴有限公司","开平美迪晨卫浴有限公司"]
["开平市金特卫浴有限公司","开平市惠普卫浴实业有限公司",null,null,"开平市安迪卫浴实业有限公司","开平市安迪卫浴实业有限公司",null,null,"开平美迪晨卫浴有限公司","开平美迪晨卫浴有限公司",null,"开平市安迪卫浴实业有限公司","开平市安迪卫浴实业有限公司"]
["开平市惠普卫浴实业有限公司","开平市力泰五金制品有限公司",null,null,"开平市宝来塑胶制品有限公司","开平市宝来塑胶制品有限公司",null,null,"开平市安迪卫浴实业有限公司","开平市安迪卫浴实业有限公司",null,"开平市宝来塑胶制品有限公司","开平市宝来塑胶制品有限公司"]
["开平市力泰五金制品有限公司","广东顶尖管业科技有限公司",null,null,"开平市博美卫浴有限公司","开平市博美卫浴有限公司",null,null,"开平市宝来塑胶制品有限公司","开平市宝来塑胶制品有限公司",null,"开平市博美卫浴有限公司","开平市博美卫浴有限公司"]
["广东顶尖管业科技有限公司","开平市东陶压铸卫浴有限公司",null,null,"开平市富丽雅实业有限公司","开平市富丽雅实业有限公司",null,null,"开平市博美卫浴有限公司","开平市博美卫浴有限公司",null,"开平市富丽雅实业有限公司","开平市富丽雅实业有限公司"]
["开平市东陶压铸卫浴有限公司","开平市汉玛克卫浴有限公司",null,null,"开平市汉玛克卫浴有限公司","开平市汉玛克卫浴有限公司",null,null,"开平市富丽雅实业有限公司","开平市富丽雅实业有限公司",null,"开平市汉玛克卫浴有限公司","开平市汉玛克卫浴有限公司"]
["开平市汉玛克卫浴有限公司","开平市智康卫浴有限公司",null,null,"开平市和洋洁具有限公司","开平市和洋洁具有限公司",null,null,"开平市汉玛克卫浴有限公司","开平市汉玛克卫浴有限公司",null,"开平市和洋洁具有限公司","开平市和洋洁具有限公司"]
["开平市智康卫浴有限公司","开平市谛玛卫浴有限公司",null,null,"开平市骏源进出口贸易有限公司","开平市骏源进出口贸易有限公司",null,null,"开平市和洋洁具有限公司","开平市和洋洁具有限公司",null,"开平市骏源进出口贸易有限公司","开平市骏源进出口贸易有限公司"]
["开平市谛玛卫浴有限公司","开平市嘉恩卫浴有限公司",null,null,"开平市凯赛德水暖配件有限公司","开平市凯赛德水暖配件有限公司",null,null,"开平市红日制衣有限公司","开平市红日制衣有限公司",null,"开平市凯赛德水暖配件有限公司","开平市凯赛德水暖配件有限公司"]
["开平市谛玛卫浴有限公司","开平市领雅厨卫有限公司",null,null,"开平市蓝凯卫浴实业有限公司","开平市蓝凯卫浴实业有限公司",null,null,"开平市骏源进出口贸易有限公司","开平市骏源进出口贸易有限公司",null,"开平市蓝凯卫浴实业有限公司","开平市蓝凯卫浴实业有限公司"]
["开平市嘉恩卫浴有限公司","开平市伯源卫浴有限公司",null,null,"开平市美年华服装有限公司","开平市美年华服装有限公司",null,null,"开平市凯赛德水暖配件有限公司","开平市凯赛德水暖配件有限公司",null,"开平市美年华服装有限公司","开平市美年华服装有限公司"]
["开平市领雅厨卫有限公司","江门市凯逸卫浴有限公司",null,null,"开平市奇迪科压铸卫浴有限公司","开平市奇迪科压铸卫浴有限公司",null,null,"开平市蓝凯卫浴实业有限公司","开平市蓝凯卫浴实业有限公司",null,"开平市奇迪科压铸卫浴有限公司","开平市奇迪科压铸卫浴有限公司"]
{"$rows_left_out":66}
{"sheet":"Sheet5","index":3,"n_rows":138,"n_cols":8,"rows_kept":138,"hidden":true}
[{"$f":"VLOOKUP(H1,Sheet6!$D:$E,2,FALSE)","v":114},114,1,"广东科仕特精密机械有限公司","2023年1月至12月中国出口信用保险公司资信服务",{"v":2700,"d":"2,700.00"},{"v":2700,"d":"2,700.00"},{"$f":"D1&E1&F1","v":"广东科仕特精密机械有限公司2023年1月至12月中国出口信用保险公司资信服务2700"}]
[{"$f":"VLOOKUP(H2,Sheet6!$D:$E,2,FALSE)","v":65},65,2,"开平欧玛莎卫浴实业有限公司","第27届中国(上海)国际厨房、卫浴设施展览会",{"v":40000,"d":"40,000.00"},{"v":40000,"d":"40,000.00"},"开平欧玛莎卫浴实业有限公司第27届中国(上海)国际厨房、卫浴设施展览会40000"]
[{"$f":"VLOOKUP(H3,Sheet6!$D:$E,2,FALSE)","v":67},67,3,"开平正霖卫浴实业有限公司","2022中国国际厨房、卫浴设施展览会（第27届）",{"v":40000,"d":"40,000.00"},{"v":40000,"d":"40,000.00"},"开平正霖卫浴实业有限公司2022中国国际厨房、卫浴设施展览会（第27届）40000"]
[{"$f":"VLOOKUP(H4,Sheet6!$D:$E,2,FALSE)","v":103},103,4,"开平市蓝凯卫浴实业有限公司","2023年1月至12月短期进出口信用保险项目",{"v":4997,"d":"4,997.00"},{"v":4997,"d":"4,997.00"},"开平市蓝凯卫浴实业有限公司2023年1月至12月短期进出口信用保险项目4997"]
[{"$f":"VLOOKUP(H5,Sheet6!$D:$E,2,FALSE)","v":132},132,5,"开平市蓝凯卫浴实业有限公司","2023年1月至12月中国出口信用保险公司资信服务",{"v":2100,"d":"2,100.00"},{"v":2100,"d":"2,100.00"},"开平市蓝凯卫浴实业有限公司2023年1月至12月中国出口信用保险公司资信服务2100"]
[{"$f":"VLOOKUP(H6,Sheet6!$D:$E,2,FALSE)","v":75},75,6,"开平市本铃机车密封垫有限公司","2023年8月21日-8月24日俄罗斯（莫斯科）国际汽车零配件及售后服务展览会",{"v":20000,"d":"20,000.00"},{"v":20000,"d":"20,000.00"},"开平市本铃机车密封垫有限公司2023年8月21日-8月24日俄罗斯（莫斯科）国际汽车零配件及售后服务展览会20000"]
[{"$f":"VLOOKUP(H7,Sheet6!$D:$E,2,FALSE)","v":116},116,7,"广东泰宝聚合物有限公司","2023年1月至12月中国出口信用保险公司资信服务",{"v":20000,"d":"20,000.00"},{"v":20000,"d":"20,000.00"},"广东泰宝聚合物有限公司2023年1月至12月中国出口信用保险公司资信服务20000"]
[{"$f":"VLOOKUP(H8,Sheet6!$D:$E,2,FALSE)","v":88},88,8,"广东泰宝聚合物有限公司","2023年1月至12月短期进出口信用保险项目",{"v":342852.06,"d":"342,852.06"},{"v":342852.06,"d":"342,852.06"},"广东泰宝聚合物有限公司2023年1月至12月短期进出口信用保险项目342852.06"]
[{"$f":"VLOOKUP(H9,Sheet6!$D:$E,2,FALSE)","v":94},94,9,"开平美迪晨卫浴有限公司","2023年1月至12月短期进出口信用保险项目",{"v":21500,"d":"21,500.00"},{"v":21500,"d":"21,500.00"},"开平美迪晨卫浴有限公司2023年1月至12月短期进出口信用保险项目21500"]
[{"$f":"VLOOKUP(H10,Sheet6!$D:$E,2,FALSE)","v":122},122,10,"开平美迪晨卫浴有限公司","2023年1月至12月中国出口信用保险公司资信服务",{"v":3300,"d":"3,300.00"},{"v":3300,"d":"3,300.00"},"开平美迪晨卫浴有限公司2023年1月至12月中国出口信用保险公司资信服务3300"]
[{"$f":"VLOOKUP(H11,Sheet6!$D:$E,2,FALSE)","v":128},128,11,"开平市和洋洁具有限公司","2023年1月至12月中国出口信用保险公司资信服务",{"v":800,"d":"800.00"},{"v":800,"d":"800.00"},"开平市和洋洁具有限公司2023年1月至12月中国出口信用保险公司资信服务800"]
[{"$f":"VLOOKUP(H12,Sheet6!$D:$E,2,FALSE)","v":100},100,12,"开平市和洋洁具有限公司","2023年1月至12月短期进出口信用保险项目",{"v":7697.8,"d":"7,697.80"},{"v":7697.8,"d":"7,697.80"},"开平市和洋洁具有限公司2023年1月至12月短期进出口信用保险项目7697.8"]
[{"$f":"VLOOKUP(H13,Sheet6!$D:$E,2,FALSE)","v":125},125,13,"开平市博美卫浴有限公司","2023年1月至12月中国出口信用保险公司资信服务",{"v":5100,"d":"5,100.00"},{"v":5100,"d":"5,100.00"},"开平市博美卫浴有限公司2023年1月至12月中国出口信用保险公司资信服务5100"]
[{"$f":"VLOOKUP(H14,Sheet6!$D:$E,2,FALSE)","v":97},97,14,"开平市博美卫浴有限公司","2023年1月至12月短期进出口信用保险项目",{"v":13800,"d":"13,800.00"},{"v":13800,"d":"13,800.00"},"开平市博美卫浴有限公司2023年1月至12月短期进出口信用保险项目13800"]
[{"$f":"VLOOKUP(H15,Sheet6!$D:$E,2,FALSE)","v":106},106,15,"开平市天雅塑料实业有限公司","2023年1月至12月短期进出口信用保险项目",{"v":7082.1,"d":"7,082.10"},{"v":7082.1,"d":"7,082.10"},"开平市天雅塑料实业有限公司2023年1月至12月短期进出口信用保险项目7082.1"]
[{"$f":"VLOOKUP(H16,Sheet6!$D:$E,2,FALSE)","v":133},133,16,"开平市奇迪科压铸卫浴有限公司","2023年1月至12月中国出口信用保险公司资信服务",{"v":1200,"d":"1,200.00"},{"v":1200,"d":"1,200.00"},"开平市奇迪科压铸卫浴有限公司2023年1月至12月中国出口信用保险公司资信服务1200"]
[{"$f":"VLOOKUP(H17,Sheet6!$D:$E,2,FALSE)","v":105},105,17,"开平市奇迪科压铸卫浴有限公司","2023年1月至12月短期进出口信用保险项目",{"v":5500,"d":"5,500.00"},{"v":5500,"d":"5,500.00"},"开平市奇迪科压铸卫浴有限公司2023年1月至12月短期进出口信用保险项目5500"]
[{"$f":"VLOOKUP(H18,Sheet6!$D:$E,2,FALSE)","v":60},60,18,"开平市奇迪科压铸卫浴有限公司","第27届中国国际厨房、卫浴设施展览会",{"v":40000,"d":"40,000.00"},{"v":40000,"d":"40,000.00"},"开平市奇迪科压铸卫浴有限公司第27届中国国际厨房、卫浴设施展览会40000"]
[{"$f":"VLOOKUP(H19,Sheet6!$D:$E,2,FALSE)","v":98},98,19,"开平市富丽雅实业有限公司","2023年1月至12月短期进出口信用保险项目",{"v":6800,"d":"6,800.00"},{"v":6800,"d":"6,800.00"},"开平市富丽雅实业有限公司2023年1月至12月短期进出口信用保险项目6800"]
[{"$f":"VLOOKUP(H20,Sheet6!$D:$E,2,FALSE)","v":126},126,20,"开平市富丽雅实业有限公司","2023年1月至12月中国出口信用保险公司资信服务",{"v":400,"d":"400.00"},{"v":400,"d":"400.00"},"开平市富丽雅实业有限公司2023年1月至12月中国出口信用保险公司资信服务400"]
{"$rows_left_out":119}
{"sheet":"Sheet6","index":4,"n_rows":140,"n_cols":5,"rows_kept":140,"hidden":true}
[]
["开平市锦强五金制品有限公司","2024年6月13日-6月15日 迪拜世贸中心 2023年第十四届中国（阿联酋）贸易博览会",{"v":17906,"d":"17,906.00"},{"$f":"A2&B2&C2","v":"开平市锦强五金制品有限公司2024年6月13日-6月15日 迪拜世贸中心 2023年第十四届中国（阿联酋）贸易博览会17906"},1]
["开平市预发卫浴有限公司","第27届中国国际厨房、卫浴设施展览会",{"v":40000,"d":"40,000.00"},{"$f":"A3&B3&C3","v":"开平市预发卫浴有限公司第27届中国国际厨房、卫浴设施展览会40000"},2]
["开平市朝升卫浴有限公司","2023年第十五届中国（阿联酋）贸易博览会",{"v":20000,"d":"20,000.00"},"开平市朝升卫浴有限公司2023年第十五届中国（阿联酋）贸易博览会20000",3]
["开平市亿展阀芯有限公司","第27届中国国际厨房、卫浴设施展览会",{"v":40000,"d":"40,000.00"},"开平市亿展阀芯有限公司第27届中国国际厨房、卫浴设施展览会40000",4]
["开平市诺曼卫浴有限公司","2023年09月20日-09月22日南非（约翰内斯堡）2023年第七届中国（南非）贸易博览会",{"v":20000,"d":"20,000.00"},"开平市诺曼卫浴有限公司2023年09月20日-09月22日南非（约翰内斯堡）2023年第七届中国（南非）贸易博览会20000",5]
["开平市新明光五金制品有限公司","2023年第四届中国（印尼）贸易博览会",{"v":20000,"d":"20,000.00"},"开平市新明光五金制品有限公司2023年第四届中国（印尼）贸易博览会20000",6]
["开平市新明光五金制品有限公司","第27届中国国际厨房、卫浴设施展览会",{"v":20000,"d":"20,000.00"},"开平市新明光五金制品有限公司第27届中国国际厨房、卫浴设施展览会20000",7]
["开平市和洋洁具有限公司","第 27 届中国国际厨房、卫浴设施展览会",{"v":30000,"d":"30,000.00"},"开平市和洋洁具有限公司第 27 届中国国际厨房、卫浴设施展览会30000",8]
["开平力蒲卫浴有限公司","第27届中国国际厨房、卫浴设施展览会",{"v":40000,"d":"40,000.00"},"开平力蒲卫浴有限公司第27届中国国际厨房、卫浴设施展览会40000",9]
["开平市金特卫浴有限公司","第27届中国国际厨房、卫浴设施展览会",{"v":40000,"d":"40,000.00"},"开平市金特卫浴有限公司第27届中国国际厨房、卫浴设施展览会40000",10]
["开平市惠普卫浴实业有限公司","第 27 届中国国际厨房、卫浴设施展览会",{"v":20000,"d":"20,000.00"},"开平市惠普卫浴实业有限公司第 27 届中国国际厨房、卫浴设施展览会20000",11]
["开平市力泰五金制品有限公司","第27届中国国际厨房、卫浴设施展览会",{"v":20000,"d":"20,000.00"},"开平市力泰五金制品有限公司第27届中国国际厨房、卫浴设施展览会20000",12]
["广东顶尖管业科技有限公司","第27届中国国际厨房、卫浴设施展览会",{"v":40000,"d":"40,000.00"},"广东顶尖管业科技有限公司第27届中国国际厨房、卫浴设施展览会40000",13]
["开平市东陶压铸卫浴有限公司","(第27届）中国(上海)国际厨房、卫浴设施展览会",{"v":20000,"d":"20,000.00"},"开平市东陶压铸卫浴有限公司(第27届）中国(上海)国际厨房、卫浴设施展览会20000",14]
["开平市汉玛克卫浴有限公司","第27届中国国际厨房、卫浴设施展览会",{"v":40000,"d":"40,000.00"},"开平市汉玛克卫浴有限公司第27届中国国际厨房、卫浴设施展览会40000",15]
["开平市智康卫浴有限公司","2023年11月23日-11月25日印尼（雅加达）2023年第五届中国（印尼）贸易博览会",{"v":20000,"d":"20,000.00"},"开平市智康卫浴有限公司2023年11月23日-11月25日印尼（雅加达）2023年第五届中国（印尼）贸易博览会20000",16]
["开平市谛玛卫浴有限公司","2023年12月19日-12月21日-阿联酋（迪拜）2023年第十五届中国（阿联酋）贸易博览会",{"v":20000,"d":"20,000.00"},"开平市谛玛卫浴有限公司2023年12月19日-12月21日-阿联酋（迪拜）2023年第十五届中国（阿联酋）贸易博览会20000",17]
["开平市谛玛卫浴有限公司","2023年12月5日-12月7日-墨西哥（墨西哥城）2023年第八届中国（墨西哥）贸易博览会",{"v":20000,"d":"20,000.00"},"开平市谛玛卫浴有限公司2023年12月5日-12月7日-墨西哥（墨西哥城）2023年第八届中国（墨西哥）贸易博览会20000",18]
["开平市嘉恩卫浴有限公司","第27届中国国际厨房、卫浴设施展览会",{"v":40000,"d":"40,000.00"},"开平市嘉恩卫浴有限公司第27届中国国际厨房、卫浴设施展览会40000",19]
{"$rows_left_out":120}